Reaction Details
TargetSodium channel protein type 10 subunit alpha
LigandBDBM181203
Substrate/Competitorn/a
Meas. Tech.Electrophysiology Assay
IC50 1±n/a nM
Citation Hadida-Ruah, SSAnderson, CArumugam, VAsgian, ILBear, BRTermin, APJohnson, JP Substituted quinoxalines as sodium channel modulators US Patent US9139529 Publication Date 9/22/2015
 
Sodium channel protein type 10 subunit alpha
Name:Sodium channel protein type 10 subunit alpha
Type:Enzyme
Mol. Mass.:219724.17
Organism:Rattus norvegicus (Rat)
Description:Q62968
Residue:1956
BDBM181203
NameBDBM181203
Synonyms:US9139529, 46 | US9783501, Compound 46
TypeSmall organic molecule
Emp. Form.C23H18FN3O5S
Mol. Mass.467.47
SMILESCOc1cc(F)ccc1Oc1nc2ccccc2nc1C(=O)Nc1cccc(c1)S(C)(=O)=O