Reaction Details
TargetCannabinoid receptor 1
LigandBDBM50248603
Substrate/Competitorn/a
Meas. Tech.CB1 Receptor Binding Protocol
Temperature303.15±n/a K
Ki>1000±n/a nM
Commentsextracted
Citation Moore, II, BMBhattacharjee, HMustafa, S Tri-aryl/heteroaromatic cannabinoids and use thereof US Patent US9139546 Publication Date 9/22/2015
 
Cannabinoid receptor 1
Name:Cannabinoid receptor 1
Type:G Protein-Coupled Receptor (GPCR)
Mol. Mass.:52868.96
Organism:Homo sapiens (Human)
Description:P21554
Residue:472
BDBM50248603
NameBDBM50248603
Synonyms:(3',5'-dichloro-2,6-dimethoxybiphenyl-4-yl)(phenyl)methanol US9139546, 15
TypeSmall organic molecule
Emp. Form.C21H18Cl2O3
Mol. Mass.389.272
SMILESCOc1cc(cc(OC)c1-c1cc(Cl)cc(Cl)c1)C(O)c1ccccc1