Reaction Details
TargetCannabinoid receptor 2
LigandBDBM50248603
Substrate/Competitorn/a
Meas. Tech.CB2 Receptor Binding Protocol
Temperature303.15±n/a K
Ki 1.66±0.38 nM
Commentsextracted
Citation Moore, II, BMBhattacharjee, HMustafa, S Tri-aryl/heteroaromatic cannabinoids and use thereof US Patent US9139546 Publication Date 9/22/2015
 
Cannabinoid receptor 2
Name:Cannabinoid receptor 2
Type:G Protein-Coupled Receptor (GPCR)
Mol. Mass.:39690.94
Organism:Homo sapiens (Human)
Description:P34972
Residue:360
BDBM50248603
NameBDBM50248603
Synonyms:(3',5'-dichloro-2,6-dimethoxybiphenyl-4-yl)(phenyl)methanol US9139546, 15
TypeSmall organic molecule
Emp. Form.C21H18Cl2O3
Mol. Mass.389.272
SMILESCOc1cc(cc(OC)c1-c1cc(Cl)cc(Cl)c1)C(O)c1ccccc1