Reaction Details
TargetMAP kinase-interacting serine/threonine-protein kinase 2
LigandBDBM181565
Substrate/Competitorn/a
Meas. Tech.In vitro Kinase Assay
IC50 1±n/a nM
Citation Blum, AGottschling, DHeckel, AHehn, JPSchmid, BWiedenmayer, D Sulfoximine substituted quinazolines for pharmaceutical compositions US Patent US9139577 Publication Date 9/22/2015
 
MAP kinase-interacting serine/threonine-protein kinase 2
Name:MAP kinase-interacting serine/threonine-protein kinase 2
Type:Protein
Mol. Mass.:51870.79
Organism:Homo sapiens (Human)
Description:Q9HBH9
Residue:465
BDBM181565
NameBDBM181565
Synonyms:US9139577, 4.071 | US9708274, 4.071
TypeSmall organic molecule
Emp. Form.C22H23F4N5O3S
Mol. Mass.513.508
SMILESC[C@@H](Oc1cc(F)ccc1Nc1ncnc2cc(cc(C)c12)N=S(C)(C)=O)C(=O)NCC(F)(F)F