Reaction Details
TargetMAP kinase-interacting serine/threonine-protein kinase 2
LigandBDBM181642
Substrate/Competitorn/a
Meas. Tech.In vitro Kinase Assay
IC50 1±n/a nM
Citation Blum, AGottschling, DHeckel, AHehn, JPSchmid, BWiedenmayer, D Sulfoximine substituted quinazolines for pharmaceutical compositions US Patent US9139577 Publication Date 9/22/2015
 
MAP kinase-interacting serine/threonine-protein kinase 2
Name:MAP kinase-interacting serine/threonine-protein kinase 2
Type:Protein
Mol. Mass.:51870.79
Organism:Homo sapiens (Human)
Description:Q9HBH9
Residue:465
BDBM181642
NameBDBM181642
Synonyms:US9139577, 5.001 | US9708274, 5.001
TypeSmall organic molecule
Emp. Form.C21H26FN5O4S2
Mol. Mass.495.591
SMILESC[C@@H](CNS(C)(=O)=O)Oc1cc(F)ccc1Nc1ncnc2cc(cc(C)c12)N=S(C)(C)=O