Reaction Details
TargetATP-sensitive inward rectifier potassium channel 1
LigandBDBM181768
Substrate/Competitorn/a
Meas. Tech.Electrophysiology Assay
pH7.4±n/a
Temperature310.15±n/a K
IC50 18±n/a nM
Commentsextracted
Citation Walsh, SPPasternak, ADeJesus, RKTang, HPio, BShahripour, ABelyk, KMChobanian, HRGuo, YFrie, JLShi, ZChen, HBlizzard, TACato, B Inhibitors of the Renal Outer Medullary Potassium channel US Patent US9139585 Publication Date 9/22/2015
 
ATP-sensitive inward rectifier potassium channel 1
Name:ATP-sensitive inward rectifier potassium channel 1
Type:Enzyme Catalytic Domain
Mol. Mass.:44809.08
Organism:Homo sapiens (Human)
Description:gi_223460826
Residue:391
BDBM181768
NameBDBM181768
Synonyms:US9139585, 44B
TypeSmall organic molecule
Emp. Form.C25H30N4O5
Mol. Mass.466.5295
SMILESCOc1cc(ncc1C#N)C(O)CN1CCN(CC(O)c2ccc3C(=O)O[C@H](C)Cc3c2)CC1