Reaction Details
TargetCytochrome P450 3A4
LigandBDBM7885
Substrate/Competitorn/a
Meas. Tech.In vitro ATRA 4-Hydroxylase Activity Assay
pH7.4±n/a
IC50 307500±n/a nM
Commentsextracted
Citation Bareja, SPJones, SDOblong, JEMills, KJBierman, JC Cosmetic compositions containing substituted azole and methods for alleviating the signs of photoaged skin US Patent US9144538 Publication Date 9/29/2015
 
Cytochrome P450 3A4
Name:Cytochrome P450 3A4
Type:Enzyme
Mol. Mass.:57349.57
Organism:Homo sapiens (Human)
Description:n/a
Residue:503
BDBM7885
NameBDBM7885
Synonyms:1-benzyl-2-methyl-1H-imidazole US9144538, 1-benzyl-2-methylimidazole
TypeSmall organic molecule
Emp. Form.C11H12N2
Mol. Mass.172.2264
SMILESCc1nccn1Cc1ccccc1