Reaction Details
TargetTyrosine-protein kinase SYK
LigandBDBM182065
Substrate/Competitorn/a
Meas. Tech.Homogeneous Time-Resolved Fluorescence (HTRF) Assay
pH7.5±n/a
Temperature298.15±n/a K
IC50<0.5±n/a nM
Commentsextracted
Citation Deschenes, DAltman, MDEllis, JMFischer, CHaidle, AMKattar, SDNorthrup, ABSchell, AJSmith, GFTaoka, BMBienstock, CDi Francesco, MEDonofrio, APeterson, SSpencer, KBJewell, JPAli, ABennett, DJDang, QWai, J Bipyridylaminopyridines as Syk inhibitors US Patent US9145391 Publication Date 9/29/2015
 
Tyrosine-protein kinase SYK
Name:Tyrosine-protein kinase SYK
Type:Enzyme
Mol. Mass.:72079.99
Organism:Homo sapiens (Human)
Description:P43405
Residue:635
BDBM182065
NameBDBM182065
Synonyms:US9145391, 1-33
TypeSmall organic molecule
Emp. Form.C28H30F2N4O3
Mol. Mass.508.5596
SMILESCC(O)(C1CCC(CC1)C(O)=O)c1ccc(cn1)-c1cc(cc(Nc2cc(ccn2)C(F)F)n1)C1CC1