Reaction Details
TargetTyrosine-protein kinase SYK
LigandBDBM182298
Substrate/Competitorn/a
Meas. Tech.Homogeneous Time-Resolved Fluorescence (HTRF) Assay
pH7.5±n/a
Temperature298.15±n/a K
IC50<0.5±n/a nM
Commentsextracted
Citation Deschenes, DAltman, MDEllis, JMFischer, CHaidle, AMKattar, SDNorthrup, ABSchell, AJSmith, GFTaoka, BMBienstock, CDi Francesco, MEDonofrio, APeterson, SSpencer, KBJewell, JPAli, ABennett, DJDang, QWai, J Bipyridylaminopyridines as Syk inhibitors US Patent US9145391 Publication Date 9/29/2015
 
Tyrosine-protein kinase SYK
Name:Tyrosine-protein kinase SYK
Type:Enzyme
Mol. Mass.:72079.99
Organism:Homo sapiens (Human)
Description:P43405
Residue:635
BDBM182298
NameBDBM182298
Synonyms:US9145391, 12-2
TypeSmall organic molecule
Emp. Form.C26H28F2N4O3
Mol. Mass.482.5223
SMILESCc1cc(Nc2cc(ccn2)C(F)F)nc(c1)-c1ccc(C[C@H](O)C2CCC(CC2)C(O)=O)nc1