Reaction Details
TargetTyrosine-protein kinase SYK
LigandBDBM182241
Substrate/Competitorn/a
Meas. Tech.Homogeneous Time-Resolved Fluorescence (HTRF) Assay
pH7.5±n/a
Temperature298.15±n/a K
IC50<0.5±n/a nM
Commentsextracted
Citation Deschenes, DAltman, MDEllis, JMFischer, CHaidle, AMKattar, SDNorthrup, ABSchell, AJSmith, GFTaoka, BMBienstock, CDi Francesco, MEDonofrio, APeterson, SSpencer, KBJewell, JPAli, ABennett, DJDang, QWai, J Bipyridylaminopyridines as Syk inhibitors US Patent US9145391 Publication Date 9/29/2015
 
Tyrosine-protein kinase SYK
Name:Tyrosine-protein kinase SYK
Type:Enzyme
Mol. Mass.:72079.99
Organism:Homo sapiens (Human)
Description:P43405
Residue:635
BDBM182241
NameBDBM182241
Synonyms:US9145391, 13
TypeSmall organic molecule
Emp. Form.C26H27F3N4O2
Mol. Mass.484.5134
SMILESCc1cc(Nc2cc(ccn2)C(F)F)nc(c1)-c1ccc(nc1)C(C)(F)[C@H]1CC[C@@H](CC1)C(O)=O