Reaction Details
TargetRibosomal protein S6 kinase beta-1
LigandBDBM182588
Substrate/Competitorn/a
Meas. Tech.P70S6K Enzyme Assay
pH7.5±n/a
Temperature298.15±n/a K
IC50 0.8±n/a nM
Commentsextracted
Citation Lan, RHuck, BRXiao, YChen, XDeselm, LCQiu, HNeagu, CBankston, DJones, CC Imidazole amines as modulators of kinase activity US Patent US9145392 Publication Date 9/29/2015
 
Ribosomal protein S6 kinase beta-1
Name:Ribosomal protein S6 kinase beta-1
Type:Enzyme
Mol. Mass.:59139.89
Organism:Homo sapiens (Human)
Description:His-tagged S6K1.
Residue:525
BDBM182588
NameBDBM182588
Synonyms:US9145392, 289
TypeSmall organic molecule
Emp. Form.C26H33ClFN7O
Mol. Mass.514.038
SMILESCCOc1c(N)ncnc1N1CCC(CC1)c1nc(cn1CCN1CCCC1)-c1ccc(F)c(Cl)c1