Reaction Details
TargetRibosomal protein S6 kinase beta-1
LigandBDBM182615
Substrate/Competitorn/a
Meas. Tech.P70S6K Enzyme Assay
pH7.5±n/a
Temperature298.15±n/a K
IC50 0.8±n/a nM
Commentsextracted
Citation Lan, RHuck, BRXiao, YChen, XDeselm, LCQiu, HNeagu, CBankston, DJones, CC Imidazole amines as modulators of kinase activity US Patent US9145392 Publication Date 9/29/2015
 
Ribosomal protein S6 kinase beta-1
Name:Ribosomal protein S6 kinase beta-1
Type:Enzyme
Mol. Mass.:59139.89
Organism:Homo sapiens (Human)
Description:His-tagged S6K1.
Residue:525
BDBM182615
NameBDBM182615
Synonyms:US9145392, 316
TypeSmall organic molecule
Emp. Form.C26H29F3N8
Mol. Mass.510.5573
SMILESCc1ccc(cc1C(F)(F)F)-c1cn(CCN2CCC2)c(n1)C1CCN(CC1)c1ncnc(N)c1C#N