Reaction Details
TargetRAC-alpha serine/threonine-protein kinase
LigandBDBM182586
Substrate/Competitorn/a
Meas. Tech.AKT Enzyme Assay
pH7.5±n/a
IC50 1±n/a nM
Commentsextracted
Citation Lan, RHuck, BRXiao, YChen, XDeselm, LCQiu, HNeagu, CBankston, DJones, CC Imidazole amines as modulators of kinase activity US Patent US9145392 Publication Date 9/29/2015
 
RAC-alpha serine/threonine-protein kinase
Name:RAC-alpha serine/threonine-protein kinase
Type:Enzyme
Mol. Mass.:55681.25
Organism:Homo sapiens (Human)
Description:P31749
Residue:480
BDBM182586
NameBDBM182586
Synonyms:US9145392, 287
TypeSmall organic molecule
Emp. Form.C26H29F4N7O
Mol. Mass.531.5484
SMILESNc1ncnc(N2CCC(CC2)c2nc(cn2CCN2CCCC2)-c2ccc(F)c(c2)C(F)(F)F)c1C=O