Reaction Details
TargetLeucine-rich repeat serine/threonine-protein kinase 2
LigandBDBM182720
Substrate/Competitorn/a
Meas. Tech.In vitro LRRK2 Lanthascreen Binding Assay
Ki 23±n/a nM
Citation Baker-Glenn, CChambers, MChan, BKEstrada, AShore, DSweeney, ZKChen, H Aminopyrimidine derivatives as LRRK2 modulators US Patent US9145402 Publication Date 9/29/2015
 
Leucine-rich repeat serine/threonine-protein kinase 2
Name:Leucine-rich repeat serine/threonine-protein kinase 2
Type:Protein
Mol. Mass.:286113.20
Organism:Homo sapiens (Human)
Description:Q5S007
Residue:2527
BDBM182720
NameBDBM182720
Synonyms:US9145402, 27
TypeSmall organic molecule
Emp. Form.C14H12F6N4O
Mol. Mass.366.2617
SMILESCNc1nc(Nc2ccc(cc2OC)C(F)(F)F)ncc1C(F)(F)F