Reaction Details
TargetLeucine-rich repeat serine/threonine-protein kinase 2
LigandBDBM182721
Substrate/Competitorn/a
Meas. Tech.In vitro LRRK2 Lanthascreen Binding Assay
Ki 35±n/a nM
Citation Baker-Glenn, CChambers, MChan, BKEstrada, AShore, DSweeney, ZKChen, H Aminopyrimidine derivatives as LRRK2 modulators US Patent US9145402 Publication Date 9/29/2015
 
Leucine-rich repeat serine/threonine-protein kinase 2
Name:Leucine-rich repeat serine/threonine-protein kinase 2
Type:Protein
Mol. Mass.:286113.20
Organism:Homo sapiens (Human)
Description:Q5S007
Residue:2527
BDBM182721
NameBDBM182721
Synonyms:US9145402, 28
TypeSmall organic molecule
Emp. Form.C13H12ClF3N4O
Mol. Mass.332.709
SMILESCNc1nc(Nc2ccc(cc2OC)C(F)(F)F)ncc1Cl