Reaction Details
TargetLeucine-rich repeat serine/threonine-protein kinase 2
LigandBDBM182725
Substrate/Competitorn/a
Meas. Tech.In vitro LRRK2 Lanthascreen Binding Assay
Ki 5.5±n/a nM
Citation Baker-Glenn, CChambers, MChan, BKEstrada, AShore, DSweeney, ZKChen, H Aminopyrimidine derivatives as LRRK2 modulators US Patent US9145402 Publication Date 9/29/2015
 
Leucine-rich repeat serine/threonine-protein kinase 2
Name:Leucine-rich repeat serine/threonine-protein kinase 2
Type:Protein
Mol. Mass.:286113.20
Organism:Homo sapiens (Human)
Description:Q5S007
Residue:2527
BDBM182725
NameBDBM182725
Synonyms:US9145402, 32
TypeSmall organic molecule
Emp. Form.C18H19F4N5O2
Mol. Mass.413.3694
SMILESCNc1nc(Nc2cc(F)c(cc2OC)N2CCCCC2=O)ncc1C(F)(F)F