Reaction Details
TargetTyrosine-protein kinase SYK
LigandBDBM182774
Substrate/Competitorn/a
Meas. Tech.Syk Kinase Inhibition Assay
pH7.5±n/a
Temperature298.15±n/a K
IC50 0.27±n/a nM
Commentsextracted
Citation Sakamoto, TMita, TShibata, KOgino, YKomatani, H 1,2,4-triazine-6-carboxamide derivative US Patent US9145414 Publication Date 9/29/2015
 
Tyrosine-protein kinase SYK
Name:Tyrosine-protein kinase SYK
Type:Enzyme
Mol. Mass.:72079.99
Organism:Homo sapiens (Human)
Description:P43405
Residue:635
BDBM182774
NameBDBM182774
Synonyms:US9145414, 48
TypeSmall organic molecule
Emp. Form.C20H25N7O2S
Mol. Mass.427.523
SMILESCOc1ccc2sc(Nc3nc(N[C@@H]4CCCC[C@@H]4N)nnc3C(N)=O)c(C)c2c1