Reaction Details
TargetSterol O-acyltransferase 1
LigandBDBM182848
Substrate/Competitorn/a
Meas. Tech.Inhibition Assay
IC50 39±n/a nM
Citation Chang, TChang, CCShibuya, YBryleva, EMurphy, SRogers, MA Method for selectively inhibiting ACAT1 in the treatment of alzheimer's disease US Patent US9149492 Publication Date 10/6/2015
 
Sterol O-acyltransferase 1
Name:Sterol O-acyltransferase 1
Type:Multi-pass membrane protein may form homo- or heterodimers.
Mol. Mass.:64751.94
Organism:Homo sapiens (Human)
Description:P35610
Residue:550
BDBM182848
NameBDBM182848
Synonyms:US9149492, Eflucimibe (F12511)
TypeSmall organic molecule
Emp. Form.C29H43NO2S
Mol. Mass.469.722
SMILESCCCCCCCCCCCCS[C@H](C(=O)Nc1cc(C)c(O)c(C)c1C)c1ccccc1