Reaction Details
TargetSterol O-acyltransferase 1
LigandBDBM182850
Substrate/Competitorn/a
Meas. Tech.Inhibition Assay
IC50 10.3±n/a nM
Citation Chang, TChang, CCShibuya, YBryleva, EMurphy, SRogers, MA Method for selectively inhibiting ACAT1 in the treatment of alzheimer's disease US Patent US9149492 Publication Date 10/6/2015
 
Sterol O-acyltransferase 1
Name:Sterol O-acyltransferase 1
Type:Multi-pass membrane protein may form homo- or heterodimers.
Mol. Mass.:64751.94
Organism:Homo sapiens (Human)
Description:P35610
Residue:550
BDBM182850
NameBDBM182850
Synonyms:US9149492, Compound 1B
TypeSmall organic molecule
Emp. Form.C30H35NO3
Mol. Mass.457.6038
SMILESCC(C)c1cccc(C(C)C)c1NC(=O)CC(=O)C(Cc1ccccc1)Cc1ccc(O)cc1