Reaction Details
TargetSterol O-acyltransferase 2
LigandBDBM182851
Substrate/Competitorn/a
Meas. Tech.Inhibition Assay
IC50 530±n/a nM
Citation Chang, TChang, CCShibuya, YBryleva, EMurphy, SRogers, MA Method for selectively inhibiting ACAT1 in the treatment of alzheimer's disease US Patent US9149492 Publication Date 10/6/2015
 
Sterol O-acyltransferase 2
Name:Sterol O-acyltransferase 2
Type:Enzyme
Mol. Mass.:59912.75
Organism:Homo sapiens (Human)
Description:O75908
Residue:522
BDBM182851
NameBDBM182851
Synonyms:US9149492, Compound 1C
TypeSmall organic molecule
Emp. Form.C43H56N2O5
Mol. Mass.680.9151
SMILESCC(C)c1cccc(C(C)C)c1NC(=O)CC(=O)C(Cc1ccccc1)Cc1ccc(OC(=O)CCCCCCN2CCCCCC2=O)cc1