Reaction Details
TargetSphingosine 1-phosphate receptor 1
LigandBDBM50313361
Substrate/Competitorn/a
Meas. Tech.Binding Assay
pH7.4±n/a
Temperature277.15±n/a K
Ki 12±n/a nM
Commentsextracted
Citation Bombrun, ASchwarz, MCrosignani, SCovini, DMarin, D 6-amino-pyrimidine-4-carboxamide derivatives and related compounds which bind to the sphingosine 1-phosphate (S1P) receptor for the treatment of multiple sclerosis US Patent US9150519 Publication Date 10/6/2015
 
Sphingosine 1-phosphate receptor 1
Name:Sphingosine 1-phosphate receptor 1
Type:Enzyme
Mol. Mass.:42836.02
Organism:Homo sapiens (Human)
Description:P21453
Residue:382
BDBM50313361
NameBDBM50313361
Synonyms:2-(4-(6-(cyclohexyl(cyclopropylmethyl)amino)pyrimidine-4-carboxamido)benzylamino)acetic acid US9150519, 1-79
TypeSmall organic molecule
Emp. Form.C24H31N5O3
Mol. Mass.437.5346
SMILESOC(=O)CNCc1ccc(NC(=O)c2cc(ncn2)N(CC2CC2)C2CCCCC2)cc1