Reaction Details
TargetSphingosine 1-phosphate receptor 1
LigandBDBM50313358
Substrate/Competitorn/a
Meas. Tech.Binding Assay
pH7.4±n/a
Temperature277.15±n/a K
Ki 6±n/a nM
Commentsextracted
Citation Bombrun, ASchwarz, MCrosignani, SCovini, DMarin, D 6-amino-pyrimidine-4-carboxamide derivatives and related compounds which bind to the sphingosine 1-phosphate (S1P) receptor for the treatment of multiple sclerosis US Patent US9150519 Publication Date 10/6/2015
 
Sphingosine 1-phosphate receptor 1
Name:Sphingosine 1-phosphate receptor 1
Type:Enzyme
Mol. Mass.:42836.02
Organism:Homo sapiens (Human)
Description:P21453
Residue:382
BDBM50313358
NameBDBM50313358
Synonyms:3-(4-(6-((cyclopropylmethyl)(propyl)amino)pyrimidine-4-carboxamido)-3-methylphenylsulfonamido)propanoic acid US9150519, 1-99
TypeSmall organic molecule
Emp. Form.C22H29N5O5S
Mol. Mass.475.561
SMILESCCCN(CC1CC1)c1cc(ncn1)C(=O)Nc1ccc(cc1C)S(=O)(=O)NCCC(O)=O