Reaction Details
TargetSphingosine 1-phosphate receptor 1
LigandBDBM183701
Substrate/Competitorn/a
Meas. Tech.Binding Assay
pH7.4±n/a
Temperature277.15±n/a K
Ki 8±n/a nM
Commentsextracted
Citation Bombrun, ASchwarz, MCrosignani, SCovini, DMarin, D 6-amino-pyrimidine-4-carboxamide derivatives and related compounds which bind to the sphingosine 1-phosphate (S1P) receptor for the treatment of multiple sclerosis US Patent US9150519 Publication Date 10/6/2015
 
Sphingosine 1-phosphate receptor 1
Name:Sphingosine 1-phosphate receptor 1
Type:Enzyme
Mol. Mass.:42836.02
Organism:Homo sapiens (Human)
Description:P21453
Residue:382
BDBM183701
NameBDBM183701
Synonyms:US9150519, 1-100
TypeSmall organic molecule
Emp. Form.C22H29N5O3
Mol. Mass.411.4974
SMILESCCCN(CC1CC1)c1cc(ncn1)C(=O)Nc1ccc(CNCC(O)=O)cc1C