Reaction Details
TargetCoagulation factor X
LigandBDBM183016
Substrate/Competitorn/a
Meas. Tech.Inhibition Assay
pH7±n/a
IC50 5±n/a nM
Commentsextracted
Citation Alet, NAltenburger, JHerault, JKirsch, RLassalle, GMallart, SPhilippo-Orts, M Sulphonylaminopyrrolidinone derivatives, their preparation and their therapeutic application US Patent US9150544 Publication Date 10/6/2015
 
Coagulation factor X
Name:Coagulation factor X
Type:Enzyme
Mol. Mass.:54726.60
Organism:Homo sapiens (Human)
Description:n/a
Residue:488
BDBM183016
NameBDBM183016
Synonyms:US9150544, 50
TypeSmall organic molecule
Emp. Form.C21H23ClN6O5S2
Mol. Mass.539.028
SMILESCN(C)c1ncc(s1)S(=O)(=O)N[C@H]1CCN([C@H](Cc2cc3ccnc(N)c3cc2Cl)C(O)=O)C1=O