Reaction Details
TargetRibosomal protein S6 kinase alpha-2
LigandBDBM50360301
Substrate/Competitorn/a
Meas. Tech.Kinase Glo Plus Assay
pH7.5±n/a
IC50 1.1±n/a nM
Commentsextracted
Citation Boyer, SJGao, DAGuo, XKirrane, Jr., TMSarko, CRSnow, RJSoleymanzadeh, FZhang, Y Heterocyclic compounds containing an indole core US Patent US9150577 Publication Date 10/6/2015
 
Ribosomal protein S6 kinase alpha-2
Name:Ribosomal protein S6 kinase alpha-2
Type:Serine/threonine-protein kinase
Mol. Mass.:83259.46
Organism:Homo sapiens (Human)
Description:n/a
Residue:733
BDBM50360301
NameBDBM50360301
Synonyms:CHEMBL1933288 | US9150577, 93
TypeSmall organic molecule
Emp. Form.C26H30N6O2
Mol. Mass.458.5554
SMILESC[C@@H]1CCNC(=O)c2cc3ccc(cc3n12)C(=O)Nc1nc2ccccc2n1CCCN(C)C