Reaction Details
TargetRibosomal protein S6 kinase alpha-2
LigandBDBM184251
Substrate/Competitorn/a
Meas. Tech.Kinase Glo Plus Assay
pH7.5±n/a
IC50 3.8±n/a nM
Commentsextracted
Citation Boyer, SJGao, DAGuo, XKirrane, Jr., TMSarko, CRSnow, RJSoleymanzadeh, FZhang, Y Heterocyclic compounds containing an indole core US Patent US9150577 Publication Date 10/6/2015
 
Ribosomal protein S6 kinase alpha-2
Name:Ribosomal protein S6 kinase alpha-2
Type:Serine/threonine-protein kinase
Mol. Mass.:83259.46
Organism:Homo sapiens (Human)
Description:n/a
Residue:733
BDBM184251
NameBDBM184251
Synonyms:US9150577, 120
TypeSmall organic molecule
Emp. Form.C25H26N6O2
Mol. Mass.442.5129
SMILESCN(C)c1cccc(Cn2cc(NC(=O)c3ccc4cc5C(=O)NCCCn5c4c3)cn2)c1