Reaction Details
TargetIsoform Alpha-4-2 of Neuronal acetylcholine receptor subunit alpha-4 (Alpha-4-2)
LigandBDBM86805
Substrate/Competitorn/a
Meas. Tech.Inhibition Assay
Ki 0.073±n/a nM
Citation Carroll, FIOndachi, PWNavarro, HADamaj, MIWoods, JHJutkiewicz, EM Nicotinic receptor compounds US Patent US9150581 Publication Date 10/6/2015
 
Isoform Alpha-4-2 of Neuronal acetylcholine receptor subunit alpha-4 (Alpha-4-2)
Name:Isoform Alpha-4-2 of Neuronal acetylcholine receptor subunit alpha-4 (Alpha-4-2)
Type:Enzyme
Mol. Mass.:70323.63
Organism:Rattus norvegicus (Rat)
Description:P09483-2
Residue:631
BDBM86805
NameBDBM86805
Synonyms:CAS_45263788 US9150581, RTI-7527-98 | rac-2-(5-(3-chlorophenyl)-6-fluoropyridin-3-yl)-7-aza-bicyclo[2.2.1]heptane hydrochloride
TypeSmall organic molecule
Emp. Form.C17H16ClFN2
Mol. Mass.302.774
SMILESFc1ncc(cc1-c1cccc(Cl)c1)C1CC2CCC1N2