Reaction Details
TargetIsoform Alpha-4-2 of Neuronal acetylcholine receptor subunit alpha-4 (Alpha-4-2)
LigandBDBM50395219
Substrate/Competitorn/a
Meas. Tech.Inhibition Assay
Ki 0.94±n/a nM
Citation Carroll, FIOndachi, PWNavarro, HADamaj, MIWoods, JHJutkiewicz, EM Nicotinic receptor compounds US Patent US9150581 Publication Date 10/6/2015
 
Isoform Alpha-4-2 of Neuronal acetylcholine receptor subunit alpha-4 (Alpha-4-2)
Name:Isoform Alpha-4-2 of Neuronal acetylcholine receptor subunit alpha-4 (Alpha-4-2)
Type:Enzyme
Mol. Mass.:70323.63
Organism:Rattus norvegicus (Rat)
Description:P09483-2
Residue:631
BDBM50395219
NameBDBM50395219
Synonyms:CHEMBL2164665 | US9150581, RTI-7527-193
TypeSmall organic molecule
Emp. Form.C17H18FN3O2S
Mol. Mass.347.407
SMILESNS(=O)(=O)c1ccc(cc1)-c1cc(cnc1F)C1CC2CCC1N2