Reaction Details
TargetCholesteryl ester transfer protein
LigandBDBM184564
Substrate/Competitorn/a
Meas. Tech.CETP In Vitro Assay
Temperature310.15±n/a K
IC50 15±n/a nM
Commentsextracted
Citation Trieselmann, THamprecht, DWagner, H Furo[3,4-c]quinoline derivatives, medicaments containing such compounds, their use and process for their preparation US Patent US9150583 Publication Date 10/6/2015
 
Cholesteryl ester transfer protein
Name:Cholesteryl ester transfer protein
Type:Enzyme
Mol. Mass.:54751.53
Organism:Homo sapiens (Human)
Description:P11597
Residue:493
BDBM184564
NameBDBM184564
Synonyms:US9150583, 1
TypeSmall organic molecule
Emp. Form.C27H30F3NO3
Mol. Mass.473.5272
SMILESCC(C)c1nc2CC3(CC3)C[C@H](O)c2c2c1[C@H](OC21CCOCC1)c1ccc(cc1)C(F)(F)F