Reaction Details
TargetCholesteryl ester transfer protein
LigandBDBM184570
Substrate/Competitorn/a
Meas. Tech.CETP In Vitro Assay
Temperature310.15±n/a K
IC50 11±n/a nM
Commentsextracted
Citation Trieselmann, THamprecht, DWagner, H Furo[3,4-c]quinoline derivatives, medicaments containing such compounds, their use and process for their preparation US Patent US9150583 Publication Date 10/6/2015
 
Cholesteryl ester transfer protein
Name:Cholesteryl ester transfer protein
Type:Enzyme
Mol. Mass.:54751.53
Organism:Homo sapiens (Human)
Description:P11597
Residue:493
BDBM184570
NameBDBM184570
Synonyms:US9150583, 7
TypeSmall organic molecule
Emp. Form.C28H32F3NO5
Mol. Mass.519.5526
SMILESCOc1cc(ccc1C(F)(F)F)[C@H]1OC2(CCOCC2)c2c1c(nc1[C@H](O)C3(CC3)C[C@H](O)c21)C(C)C