Reaction Details
TargetGlycylpeptide N-tetradecanoyltransferase 1
LigandBDBM184903
Substrate/Competitorn/a
Meas. Tech.Enzyme Inhibition Assay
pH7.4±n/a
Temperature298.15±n/a K
IC50 8±n/a nM
Commentsextracted
Citation Brand, SWyatt, PThompson, SSmith, VBayliss, THarrison, JNorcross, NCleghorn, LGilbert, IBrenk, R N-myristoyl transferase inhibitors US Patent US9156811 Publication Date 10/13/2015
 
Glycylpeptide N-tetradecanoyltransferase 1
Name:Glycylpeptide N-tetradecanoyltransferase 1
Type:Enzyme
Mol. Mass.:56814.10
Organism:Homo sapiens (Human)
Description:P30419
Residue:496
BDBM184903
NameBDBM184903
Synonyms:US9156811, DDD87748
TypeSmall organic molecule
Emp. Form.C22H28N6O2S
Mol. Mass.440.562
SMILESCC1CN(CCN1)c1cc(ccn1)-c1ccc(cc1)[S+]([O-])(=O)Nc1c(C)nn(C)c1C