Reaction Details
TargetGlycylpeptide N-tetradecanoyltransferase 1
LigandBDBM184943
Substrate/Competitorn/a
Meas. Tech.Enzyme Inhibition Assay
pH7.4±n/a
Temperature298.15±n/a K
IC50 5±n/a nM
Commentsextracted
Citation Brand, SWyatt, PThompson, SSmith, VBayliss, THarrison, JNorcross, NCleghorn, LGilbert, IBrenk, R N-myristoyl transferase inhibitors US Patent US9156811 Publication Date 10/13/2015
 
Glycylpeptide N-tetradecanoyltransferase 1
Name:Glycylpeptide N-tetradecanoyltransferase 1
Type:Enzyme
Mol. Mass.:56814.10
Organism:Homo sapiens (Human)
Description:P30419
Residue:496
BDBM184943
NameBDBM184943
Synonyms:US9156811, DDD88193
TypeSmall organic molecule
Emp. Form.C22H26Cl2N6O2S
Mol. Mass.509.452
SMILESCN(c1c(C)nn(C)c1C)[S+]([O-])(=O)c1c(Cl)cc(cc1Cl)-c1ccnc(c1)N1CCNCC1