Reaction Details
TargetGlycylpeptide N-tetradecanoyltransferase 1
LigandBDBM184978
Substrate/Competitorn/a
Meas. Tech.Enzyme Inhibition Assay
pH7.4±n/a
Temperature298.15±n/a K
IC50 4±n/a nM
Commentsextracted
Citation Brand, SWyatt, PThompson, SSmith, VBayliss, THarrison, JNorcross, NCleghorn, LGilbert, IBrenk, R N-myristoyl transferase inhibitors US Patent US9156811 Publication Date 10/13/2015
 
Glycylpeptide N-tetradecanoyltransferase 1
Name:Glycylpeptide N-tetradecanoyltransferase 1
Type:Enzyme
Mol. Mass.:56814.10
Organism:Homo sapiens (Human)
Description:P30419
Residue:496
BDBM184978
NameBDBM184978
Synonyms:US9156811, DDD90022
TypeSmall organic molecule
Emp. Form.C21H30Cl2N4O2S
Mol. Mass.473.46
SMILESCN(c1c(C)nn(C)c1C)[S+]([O-])(=O)c1c(Cl)cc(CCCC2CCNCC2)cc1Cl