Reaction Details
TargetGlycylpeptide N-tetradecanoyltransferase 1
LigandBDBM185078
Substrate/Competitorn/a
Meas. Tech.Enzyme Inhibition Assay
pH7.4±n/a
Temperature298.15±n/a K
IC50 7±n/a nM
Commentsextracted
Citation Brand, SWyatt, PThompson, SSmith, VBayliss, THarrison, JNorcross, NCleghorn, LGilbert, IBrenk, R N-myristoyl transferase inhibitors US Patent US9156811 Publication Date 10/13/2015
 
Glycylpeptide N-tetradecanoyltransferase 1
Name:Glycylpeptide N-tetradecanoyltransferase 1
Type:Enzyme
Mol. Mass.:56814.10
Organism:Homo sapiens (Human)
Description:P30419
Residue:496
BDBM185078
NameBDBM185078
Synonyms:US9156811, DDD100164
TypeSmall organic molecule
Emp. Form.C22H31Cl2F2N5O2S
Mol. Mass.538.482
SMILESCN1CCCN(CCCc2cc(Cl)c(c(Cl)c2)[S+]([O-])(=O)N(C(F)F)c2c(C)nn(C)c2C)CC1