Reaction Details
TargetGlycylpeptide N-tetradecanoyltransferase 1
LigandBDBM185080
Substrate/Competitorn/a
Meas. Tech.Enzyme Inhibition Assay
pH7.4±n/a
Temperature298.15±n/a K
IC50 8±n/a nM
Commentsextracted
Citation Brand, SWyatt, PThompson, SSmith, VBayliss, THarrison, JNorcross, NCleghorn, LGilbert, IBrenk, R N-myristoyl transferase inhibitors US Patent US9156811 Publication Date 10/13/2015
 
Glycylpeptide N-tetradecanoyltransferase 1
Name:Glycylpeptide N-tetradecanoyltransferase 1
Type:Enzyme
Mol. Mass.:56814.10
Organism:Homo sapiens (Human)
Description:P30419
Residue:496
BDBM185080
NameBDBM185080
Synonyms:US9156811, DDD100166
TypeSmall organic molecule
Emp. Form.C21H29Cl2F2N5O2S
Mol. Mass.524.455
SMILESCc1nn(C)c(C)c1N(C(F)F)[S+]([O-])(=O)c1c(Cl)cc(CCCN2CCCNCC2)cc1Cl