Reaction Details
TargetFerrochelatase, mitochondrial [R115L]
LigandBDBM185145
Substrate/Competitorn/a
Meas. Tech.Competition Binding Assays
Kd 4.4e+3±n/a nM
Citation Klaeger, SGohlke, BPerrin, JGupta, VHeinzlmeir, SHelm, DQiao, HBergamini, GHanda, HSavitski, MMBantscheff, MMédard, GPreissner, RKuster, B Chemical Proteomics Reveals Ferrochelatase as a Common Off-target of Kinase Inhibitors. ACS Chem Biol11:1245-54 (2016) 
 
Ferrochelatase, mitochondrial [R115L]
Name:Ferrochelatase, mitochondrial [R115L]
Type:Protein
Mol. Mass.:47832.73
Organism:Homo sapiens (Human)
Description:Mutant R115L used for experiment
Residue:423
BDBM185145
NameBDBM185145
Synonyms:7-[3-(azetidin-1-ylmethyl)cyclobutyl]-5-(3-phenylmethoxyphenyl)pyrrolo[2,3-d]pyrimidin-4-amine | AEW-541
TypeSmall organic molecule
Emp. Form.C27H29N5O
Mol. Mass.439.5521
SMILESNc1ncnc2n(cc(-c3cccc(OCc4ccccc4)c3)c12)C1CC(CN2CCC2)C1