Reaction Details
TargetFerrochelatase, mitochondrial [R115L]
LigandBDBM185146
Substrate/Competitorn/a
Meas. Tech.Competition Binding Assays
Kd 6.4e+3±n/a nM
Citation Klaeger, SGohlke, BPerrin, JGupta, VHeinzlmeir, SHelm, DQiao, HBergamini, GHanda, HSavitski, MMBantscheff, MMédard, GPreissner, RKuster, B Chemical Proteomics Reveals Ferrochelatase as a Common Off-target of Kinase Inhibitors. ACS Chem Biol11:1245-54 (2016) 
 
Ferrochelatase, mitochondrial [R115L]
Name:Ferrochelatase, mitochondrial [R115L]
Type:Protein
Mol. Mass.:47832.73
Organism:Homo sapiens (Human)
Description:Mutant R115L used for experiment
Residue:423
BDBM185146
NameBDBM185146
Synonyms:6-[5-[(2-methylsulfonylethylamino)methyl]furan-2-yl]-N-[3-methyl-4-([1,2,4]triazolo[1,5-a]pyridin-7-yloxy)phenyl]quinazolin-4-amine | ARRY-380
TypeSmall organic molecule
Emp. Form.C29H27N7O4S
Mol. Mass.569.634
SMILESCc1cc(Nc2ncnc3ccc(cc23)-c2ccc(CNCCS(C)(=O)=O)o2)ccc1Oc1ccn2ncnc2c1