Reaction Details
TargetFerrochelatase, mitochondrial [R115L]
LigandBDBM50348452
Substrate/Competitorn/a
Meas. Tech.Competition Binding Assays
Kd 6.2e+3±n/a nM
Citation Klaeger, SGohlke, BPerrin, JGupta, VHeinzlmeir, SHelm, DQiao, HBergamini, GHanda, HSavitski, MMBantscheff, MMédard, GPreissner, RKuster, B Chemical Proteomics Reveals Ferrochelatase as a Common Off-target of Kinase Inhibitors. ACS Chem Biol11:1245-54 (2016) 
 
Ferrochelatase, mitochondrial [R115L]
Name:Ferrochelatase, mitochondrial [R115L]
Type:Protein
Mol. Mass.:47832.73
Organism:Homo sapiens (Human)
Description:Mutant R115L used for experiment
Residue:423
BDBM50348452
NameBDBM50348452
Synonyms:AZD-8055 US9102670, 1a
TypeSmall organic molecule
Emp. Form.C25H31N5O4
Mol. Mass.465.5447
SMILESCOc1ccc(cc1CO)-c1ccc2c(nc(nc2n1)N1CCOC[C@@H]1C)N1CCOC[C@@H]1C