Reaction Details
TargetFerrochelatase, mitochondrial [R115L]
LigandBDBM50021574
Substrate/Competitorn/a
Meas. Tech.Competition Binding Assays
Kd 2.8e+3±n/a nM
Citation Klaeger, SGohlke, BPerrin, JGupta, VHeinzlmeir, SHelm, DQiao, HBergamini, GHanda, HSavitski, MMBantscheff, MMédard, GPreissner, RKuster, B Chemical Proteomics Reveals Ferrochelatase as a Common Off-target of Kinase Inhibitors. ACS Chem Biol11:1245-54 (2016) 
 
Ferrochelatase, mitochondrial [R115L]
Name:Ferrochelatase, mitochondrial [R115L]
Type:Protein
Mol. Mass.:47832.73
Organism:Homo sapiens (Human)
Description:Mutant R115L used for experiment
Residue:423
BDBM50021574
NameBDBM50021574
Synonyms:BMS-907351 CHEBI:72317 Cometriq US10202365, Compound Cabozantinib US10273211, Compound Cabozantinib US10774070, Compound Cabozantinib XL-184 | cabozantinib s-malate
TypeSmall organic molecule
Emp. Form.C28H24FN3O5
Mol. Mass.501.5057
SMILESCOc1cc2nccc(Oc3ccc(NC(=O)C4(CC4)C(=O)Nc4ccc(F)cc4)cc3)c2cc1OC