Reaction Details
TargetFerrochelatase, mitochondrial [R115L]
LigandBDBM50307768
Substrate/Competitorn/a
Meas. Tech.Competition Binding Assays
Kd 3.5e+3±n/a nM
Citation Klaeger, SGohlke, BPerrin, JGupta, VHeinzlmeir, SHelm, DQiao, HBergamini, GHanda, HSavitski, MMBantscheff, MMédard, GPreissner, RKuster, B Chemical Proteomics Reveals Ferrochelatase as a Common Off-target of Kinase Inhibitors. ACS Chem Biol11:1245-54 (2016) 
 
Ferrochelatase, mitochondrial [R115L]
Name:Ferrochelatase, mitochondrial [R115L]
Type:Protein
Mol. Mass.:47832.73
Organism:Homo sapiens (Human)
Description:Mutant R115L used for experiment
Residue:423
BDBM50307768
NameBDBM50307768
Synonyms:7-(4-(3-Ethynylphenylamino)-7-methoxyquinazolin-6-yloxy)-N-hydroxyheptanamide CUDC-101
TypeSmall organic molecule
Emp. Form.C24H26N4O4
Mol. Mass.434.4876
SMILESCOc1cc2ncnc(Nc3cccc(c3)C#C)c2cc1OCCCCCCC(=O)NO