Reaction Details
TargetFerrochelatase, mitochondrial [R115L]
LigandBDBM50331094
Substrate/Competitorn/a
Meas. Tech.Competition Binding Assays
Kd 3.1e+3±n/a nM
Citation Klaeger, SGohlke, BPerrin, JGupta, VHeinzlmeir, SHelm, DQiao, HBergamini, GHanda, HSavitski, MMBantscheff, MMédard, GPreissner, RKuster, B Chemical Proteomics Reveals Ferrochelatase as a Common Off-target of Kinase Inhibitors. ACS Chem Biol11:1245-54 (2016) 
 
Ferrochelatase, mitochondrial [R115L]
Name:Ferrochelatase, mitochondrial [R115L]
Type:Protein
Mol. Mass.:47832.73
Organism:Homo sapiens (Human)
Description:Mutant R115L used for experiment
Residue:423
BDBM50331094
NameBDBM50331094
Synonyms:4-(3-chloro-4-(3-cyclopropylureido)phenoxy)-7-methoxyquinoline-6-carboxamide CHEMBL1289601 Lenvatinib mesilate lenvatinib
TypeSmall organic molecule
Emp. Form.C21H19ClN4O4
Mol. Mass.426.853
SMILESCOc1cc2nccc(Oc3ccc(NC(=O)NC4CC4)c(Cl)c3)c2cc1C(N)=O