Reaction Details
TargetProtein-glutamine gamma-glutamyltransferase K
LigandBDBM185183
Substrate/Competitorn/a
Meas. Tech.TG Activity Assays
IC50 3e+3±n/a nM
Citation Badarau, EWang, ZRathbone, DLCostanzi, AThibault, TMurdoch, CEEl Alaoui, SBartkeviciute, MGriffin, M Development of Potent and Selective Tissue Transglutaminase Inhibitors: Their Effect on TG2 Function and Application in Pathological Conditions. Chem Biol22:1347-61 (2015) 
 
Protein-glutamine gamma-glutamyltransferase K
Name:Protein-glutamine gamma-glutamyltransferase K
Type:Protein
Mol. Mass.:89778.63
Organism:Homo sapiens (Human)
Description:n/a
Residue:817
BDBM185183
NameBDBM185183
Synonyms:2-(1-Adamantyl)ethyl 4-[2-[(2-bromoacetyl)amino]acetyl]piperazine-1-carboxylate (6g)
TypeSmall organic molecule
Emp. Form.C21H32BrN3O4
Mol. Mass.470.4
SMILESBrCC(=O)NCC(=O)N1CCN(CC1)C(=O)OCCC12CC3CC(CC(C3)C1)C2