Reaction Details
TargetLeucine-rich repeat serine/threonine-protein kinase 2 [G2019S]
LigandBDBM50059318
Substrate/Competitorn/a
Meas. Tech.Lantha Screen Technology Assay
pH7.5±n/a
IC50 7±n/a nM
Commentsextracted
Citation Galatsis, PHayward, MMKormos, BLWager, TTZhang, LStepan, AFHenderson, JLKurumbail, RGVerhoest, PR 4-(substituted amino)-7H-pyrrolo[2,3-d] pyrimidines as LRRK2 inhibitors US Patent US9156845 Publication Date 10/13/2015
 
Leucine-rich repeat serine/threonine-protein kinase 2 [G2019S]
Name:Leucine-rich repeat serine/threonine-protein kinase 2 [G2019S]
Type:n/a
Mol. Mass.:286143.23
Organism:Homo sapiens (Human)
Description:Q5S007(G2019S)
Residue:2527
BDBM50059318
NameBDBM50059318
Synonyms:CHEMBL3393356 | US9156845, 78
TypeSmall organic molecule
Emp. Form.C17H14FN5O
Mol. Mass.323.3244
SMILESFc1c(cccc1-c1c[nH]c2ncnc(N3CCOCC3)c12)C#N