Reaction Details
TargetLeucine-rich repeat serine/threonine-protein kinase 2 [G2019S]
LigandBDBM185531
Substrate/Competitorn/a
Meas. Tech.Lantha Screen Technology Assay
pH7.5±n/a
IC50 23±n/a nM
Commentsextracted
Citation Galatsis, PHayward, MMKormos, BLWager, TTZhang, LStepan, AFHenderson, JLKurumbail, RGVerhoest, PR 4-(substituted amino)-7H-pyrrolo[2,3-d] pyrimidines as LRRK2 inhibitors US Patent US9156845 Publication Date 10/13/2015
 
Leucine-rich repeat serine/threonine-protein kinase 2 [G2019S]
Name:Leucine-rich repeat serine/threonine-protein kinase 2 [G2019S]
Type:n/a
Mol. Mass.:286143.23
Organism:Homo sapiens (Human)
Description:Q5S007(G2019S)
Residue:2527
BDBM185531
NameBDBM185531
Synonyms:US9156845, 185
TypeSmall organic molecule
Emp. Form.C17H16F2N4O
Mol. Mass.330.3319
SMILESCOc1ccc(F)cc1-c1c[nH]c2ncnc(N3CC[C@H](F)C3)c12