Reaction Details
TargetDiscoidin domain-containing receptor 2
LigandBDBM185584
Substrate/Competitorn/a
Meas. Tech.Kinase Activity
IC50 5±n/a nM
Citation Bae, IHSon, JBHan, SMKwak, EJKim, HSSong, JYByun, EYJun, SAAhn, YGSuh, KH Thieno[3,2-D]pyrimidine derivatives having inhibitory activity for protein kinases US Patent US9156852 Publication Date 10/13/2015
 
Discoidin domain-containing receptor 2
Name:Discoidin domain-containing receptor 2
Type:Protein
Mol. Mass.:96717.07
Organism:Homo sapiens (Human)
Description:Q16832
Residue:855
BDBM185584
NameBDBM185584
Synonyms:US9156852, 1 | USRE47451, Example 1
TypeSmall organic molecule
Emp. Form.C23H17ClN6OS
Mol. Mass.460.939
SMILESCc1ccc2c(Nc3ccc(Cl)cc3)nccc2c1NC(=O)c1csc2c(N)ncnc12