Reaction Details
TargetProto-oncogene tyrosine-protein kinase Src [251-533]
LigandBDBM185670
Substrate/Competitorn/a
Meas. Tech.Kinome-Wide Inhibitor Profiling
Kd 0.53±0.01 nM
Citation Kwarcinski, FEBrandvold, KRPhadke, SBeleh, OMJohnson, TKMeagher, JLSeeliger, MAStuckey, JASoellner, MB Conformation-Selective Analogues of Dasatinib Reveal Insight into Kinase Inhibitor Binding and Selectivity. ACS Chem Biol11:1296-304 (2016) 
 
Proto-oncogene tyrosine-protein kinase Src [251-533]
Name:Proto-oncogene tyrosine-protein kinase Src [251-533]
Type:Protein
Mol. Mass.:32360.42
Organism:Gallus gallus (Chicken)
Description:Wild-type chicken c-Src kinase domain (251-533aa)
Residue:283
BDBM185670
NameBDBM185670
Synonyms:DAS-DFGO-I | N-(2-chloro-6-methylphenyl)-2-[[6-[4-(2-hydroxyethyl)piperazin-1-yl]-2-methylpyrimidin-4-yl]amino]-1,3-thiazole-5-carboxamide
TypeSmall organic molecule
Emp. Form.C29H29F3N8O3S
Mol. Mass.626.653
SMILESCc1nc(Nc2ncc(s2)C(=O)Nc2cccc(NC(=O)c3cccc(c3)C(F)(F)F)c2)cc(n1)N1CCN(CCO)CC1