Reaction Details
TargetProto-oncogene tyrosine-protein kinase Src [251-533]
LigandBDBM185671
Substrate/Competitorn/a
Meas. Tech.Kinome-Wide Inhibitor Profiling
Kd 2.7±0.01 nM
Citation Kwarcinski, FEBrandvold, KRPhadke, SBeleh, OMJohnson, TKMeagher, JLSeeliger, MAStuckey, JASoellner, MB Conformation-Selective Analogues of Dasatinib Reveal Insight into Kinase Inhibitor Binding and Selectivity. ACS Chem Biol11:1296-304 (2016) 
 
Proto-oncogene tyrosine-protein kinase Src [251-533]
Name:Proto-oncogene tyrosine-protein kinase Src [251-533]
Type:Protein
Mol. Mass.:32360.42
Organism:Gallus gallus (Chicken)
Description:Wild-type chicken c-Src kinase domain (251-533aa)
Residue:283
BDBM185671
NameBDBM185671
Synonyms:DAS-DFGO-II
TypeSmall organic molecule
Emp. Form.C30H31F3N8O3S
Mol. Mass.640.679
SMILESCc1nc(Nc2ncc(s2)C(=O)Nc2cc(NC(=O)c3cccc(c3)C(F)(F)F)ccc2C)cc(n1)N1CCN(CCO)CC1