Reaction Details
TargetProto-oncogene tyrosine-protein kinase Src [251-533]
LigandBDBM185675
Substrate/Competitorn/a
Meas. Tech.End Point Fluorescence Assay
pH8±n/a
Kd 0.50±0.0 nM
Commentsextracted
Citation Kwarcinski, FEBrandvold, KRPhadke, SBeleh, OMJohnson, TKMeagher, JLSeeliger, MAStuckey, JASoellner, MB Conformation-Selective Analogues of Dasatinib Reveal Insight into Kinase Inhibitor Binding and Selectivity. ACS Chem Biol11:1296-304 (2016) 
 
Proto-oncogene tyrosine-protein kinase Src [251-533]
Name:Proto-oncogene tyrosine-protein kinase Src [251-533]
Type:Protein
Mol. Mass.:32360.42
Organism:Gallus gallus (Chicken)
Description:Wild-type chicken c-Src kinase domain (251-533aa)
Residue:283
BDBM185675
NameBDBM185675
Synonyms:DAS-BODIPY
TypeSmall organic molecule
Emp. Form.C34H35BClF2N9O2S
Mol. Mass.718.027
SMILESCc1cc(C)n2c1C=C1C=CC(CCC(=O)N3CCN(CC3)c3cc(Nc4ncc(s4)C(=O)Nc4c(C)cccc4Cl)nc(C)n3)=[N+]1[B-]2(F)F