Reaction Details
TargetD(2) dopamine receptor
LigandBDBM185683
Substrate/Competitorn/a
Meas. Tech.Radioligand Binding Assay
pH7.4±n/a
Ki 4.4±0.3 nM
Commentsextracted
Citation Jin, JRoth, BFrye, S Functionally selective ligands of dopamine D2 receptors US Patent US9156822 Publication Date 10/13/2015
 
D(2) dopamine receptor
Name:D(2) dopamine receptor
Type:Cell-surface receptors
Mol. Mass.:50647.10
Organism:Homo sapiens (Human)
Description:P14416
Residue:443
BDBM185683
NameBDBM185683
Synonyms:UNC10107959 | US9156822, 13
TypeSmall organic molecule
Emp. Form.C25H34N4O3
Mol. Mass.438.5625
SMILESCCOc1ccccc1N1CCCN(CCCCOc2ccc3CCC(=O)Nc3n2)CC1