Reaction Details
TargetD(2) dopamine receptor
LigandBDBM50395580
Substrate/Competitorn/a
Meas. Tech.Radioligand Binding Assay
pH7.4±n/a
Ki 15±3 nM
Commentsextracted
Citation Jin, JRoth, BFrye, S Functionally selective ligands of dopamine D2 receptors US Patent US9156822 Publication Date 10/13/2015
 
D(2) dopamine receptor
Name:D(2) dopamine receptor
Type:Cell-surface receptors
Mol. Mass.:50647.10
Organism:Homo sapiens (Human)
Description:P14416
Residue:443
BDBM50395580
NameBDBM50395580
Synonyms:CHEMBL2165135 US9156822, 35
TypeSmall organic molecule
Emp. Form.C21H24Cl2N4O2
Mol. Mass.435.347
SMILESClc1cccc(N2CCN(CCCCOc3ccc4[nH]c(=O)[nH]c4c3)CC2)c1Cl